{"text_format":"1","workbook":"xlsx","n_sheets":7,"sheets":["Sheet2","Sheet3","Sheet4","LINELIGHT Spec Builder","LINELIGHT Code Finder","Orelle Spec Builder (2)","Driver Starter Lead Info"],"not_rendered":{"charts":0,"images":6,"macros":1,"external_links":0,"defined_names":13,"comments":0,"pivot_tables":0},"unopened":[],"bounds":{"document_bytes":16777216,"sheet_cells":100000,"rows_first":2000,"rows_last":500,"rows_between":2000,"halvings":0,"cell_chars":16384,"cell_head_chars":4096},"cells_cut":0,"cells_raw":0,"read":"whole","date_system":"1900"}

{"sheet":"Sheet2","index":0,"n_rows":35,"n_cols":13,"rows_kept":35,"cut":false,"hidden":true,"merged":[]}
["orelle pro","70w","up to 4m",null,"Please select from list"]
["orelle pro","175w","up to 11m",null,"LINELIGHT Stable white",null,{"$f":"CONCATENATE(E$2,\"/\",E7)","v":"LINELIGHT Stable white/EVG"},"LINELIGHT Stable white/EVG/320W","LINELIGHT DRIVER 1992A/320W EVG",21100298,{"$f":"CONCATENATE(I2,\" - \",J2)","v":"LINELIGHT DRIVER 1992A/320W EVG - 21100298"},"LINELIGHT DRIVER 1992A/70W EVG",21100296]
["orelle pro","350w","up to 18m",null,"LINELIGHT Balanced white",null,{"$f":"CONCATENATE(E$2,\"/\",E8)","v":"LINELIGHT Stable white/LDO"},"LINELIGHT Stable white/LDO/320W","LINELIGHT DRIVER 1992A/320W LDO",21100301,{"$f":"CONCATENATE(I3,\" - \",J3)","v":"LINELIGHT DRIVER 1992A/320W LDO - 21100301"},"LINELIGHT DRIVER 1992A/70W LDO",21100299]
["orelle pro dynamic white ","70w","up to 1.8m",null,"LINELIGHT Stable white (HO)",null,{"$f":"CONCATENATE(E$3,\"/\",E8)","v":"LINELIGHT Balanced white/LDO"},"LINELIGHT Balanced white/LDO/320W","LINELIGHT DRIVER 1992A/BW/320W LDO",21100304,{"$f":"CONCATENATE(I4,\" - \",J4)","v":"LINELIGHT DRIVER 1992A/BW/320W LDO - 21100304"},"LINELIGHT DRIVER 1992A/175W EVG",21100297]
["orelle pro dynamic white ","175w","up to 4m",null,null,null,null,"LINELIGHT Stable White (HO)/EVG/320W","LINELIGHT DRIVER 1992A/320W EVG",21100298,{"$f":"CONCATENATE(I5,\" - \",J5)","v":"LINELIGHT DRIVER 1992A/320W EVG - 21100298"},"LINELIGHT DRIVER 1992A/175W LDO",21100300]
["orelle pro dynamic white ","350w","up to 8m",null,"Choose dimming protocol",null,null,"LINELIGHT Stable White (HO)/LDO/320W","LINELIGHT DRIVER 1992A/320W LDO",21100301,"LINELIGHT DRIVER 1992A/320W LDO - 21100301","LINELIGHT DRIVER 1992A/320W EVG",21100298]
["orelle pro+","70w",1,null,"EVG",null,null,"LINELIGHT Stable white/EVG/175W","LINELIGHT DRIVER 1992A/175W EVG",21100297,"LINELIGHT DRIVER 1992A/175W EVG - 21100297","LINELIGHT DRIVER 1992A/320W LDO",21100301]
["orelle pro+","175w","up to 4m",null,"LDO",null,null,"LINELIGHT Stable white/LDO/175W","LINELIGHT DRIVER 1992A/175W LDO",21100300,"LINELIGHT DRIVER 1992A/175W LDO - 21100300","LINELIGHT DRIVER 1992A/BW/70W LDO",21100302]
["orelle pro+","350w",6,null,null,null,null,"LINELIGHT Balanced white/LDO/175W","LINELIGHT DRIVER 1992A/BW/175W LDO",21100303,"LINELIGHT DRIVER 1992A/BW/175W LDO - 21100303","LINELIGHT DRIVER 1992A/BW/320W LDO",21100304]
[null,null,null,null,null,null,null,"LINELIGHT Stable White (HO)/EVG/175W","LINELIGHT DRIVER 1992A/175W EVG",21100297,"LINELIGHT DRIVER 1992A/175W EVG - 21100297","LINELIGHT DRIVER 1992A/BW/175W LDO",21100303]
["Please select from list","Please select from list","Please select from list","Please select from list","Please select from list",null,null,"LINELIGHT Stable White (HO)/LDO/175W","LINELIGHT DRIVER 1992A/175W LDO",21100300,"LINELIGHT DRIVER 1992A/175W LDO - 21100300"]
["1810mm",827,"Diffuse","Cowl",null,null,null,"LINELIGHT Stable white/EVG/70W","LINELIGHT DRIVER 1992A/70W EVG",21100296,"LINELIGHT DRIVER 1992A/70W EVG - 21100296"]
["910mm",830,null,"No Cowl",null,null,null,"LINELIGHT Stable white/LDO/70W","LINELIGHT DRIVER 1992A/70W LDO",21100299,"LINELIGHT DRIVER 1992A/70W LDO - 21100299"]
["610mm",840,null,null,null,null,null,"LINELIGHT Balanced white/LDO/70W","LINELIGHT DRIVER 1992A/BW/70W LDO",21100302,{"$f":"CONCATENATE(I14,\" - \",J14)","v":"LINELIGHT DRIVER 1992A/BW/70W LDO - 21100302"}]
["310mm",null,null,null,null,null,null,"LINELIGHT Stable White (HO)/EVG/70W","LINELIGHT DRIVER 1992A/70W EVG",21100296,"LINELIGHT DRIVER 1992A/70W EVG - 21100296"]
{"$rows_left_out":21}
{"sheet":"Sheet3","index":1,"n_rows":111,"n_cols":15,"rows_kept":111,"cut":false,"hidden":true,"merged":[]}
["Zumtobel Product Code",1,2,3,4,5,6,7,8,9,10,"Zumtobel Product Code",12,"Linelight","SAP Code"]
["ORELLE PRO L01 180-827 AS FG CW 40","LINELIGHT","LINELIGHT Stable white","160mm",180,827,"AS","Diffuse","Cowl",40,{"$f":"CONCATENATE(C2,D2,F2,H2,I2)","v":"LINELIGHT Stable white160mm827DiffuseCowl"},"ORELLE PRO L01 180-827 AS FG CW 40",{"$f":"IFERROR(VLOOKUP(L2,Sheet4!B:C,2,0),\"Contact acdc for SAP code\")","v":21005393},"LINELIGHT 180-827 L160 CW SR",21013730]
["ORELLE PRO L01 180-827 AS FG 40","LINELIGHT","LINELIGHT Stable white","160mm",180,827,"AS","Diffuse","No Cowl",40,{"$f":"CONCATENATE(C3,D3,F3,H3,I3)","v":"LINELIGHT Stable white160mm827DiffuseNo Cowl"},"ORELLE PRO L01 180-827 AS FG 40",{"$f":"IFERROR(VLOOKUP(L3,Sheet4!B:C,2,0),\"Contact acdc for SAP code\")","v":21005394},"LINELIGHT 180-827 L160 SR",21013731]
["ORELLE PRO L01 180-830 AS FG CW 40","LINELIGHT","LINELIGHT Stable white","160mm",180,830,"AS","Diffuse","Cowl",40,"LINELIGHT Stable white160mm830DiffuseCowl","ORELLE PRO L01 180-830 AS FG CW 40",{"$f":"IFERROR(VLOOKUP(L4,Sheet4!B:C,2,0),\"Contact acdc for SAP code\")","v":21005395},"LINELIGHT 180-830 L160 CW SR",21013700]
["ORELLE PRO L01 180-830 AS FG 40","LINELIGHT","LINELIGHT Stable white","160mm",180,830,"AS","Diffuse","No Cowl",40,"LINELIGHT Stable white160mm830DiffuseNo Cowl","ORELLE PRO L01 180-830 AS FG 40",{"$f":"IFERROR(VLOOKUP(L5,Sheet4!B:C,2,0),\"Contact acdc for SAP code\")","v":21005396},"LINELIGHT 180-830 L160 SR",21013701]
["ORELLE PRO L01 180-842 AS FG CW 40","LINELIGHT","LINELIGHT Stable white","160mm",180,840,"AS","Diffuse","Cowl",40,"LINELIGHT Stable white160mm840DiffuseCowl","ORELLE PRO L01 180-840 AS FG CW 40",{"$f":"IFERROR(VLOOKUP(L6,Sheet4!B:C,2,0),\"Contact acdc for SAP code\")","v":"Contact acdc for SAP code"},"LINELIGHT 180-840 L160 CW SR","Create code in MyProduct VIVA"]
["ORELLE PRO L01 180-842 AS FG 40","LINELIGHT","LINELIGHT Stable white","160mm",180,840,"AS","Diffuse","No Cowl",40,"LINELIGHT Stable white160mm840DiffuseNo Cowl","ORELLE PRO L01 180-840 AS FG 40",{"$f":"IFERROR(VLOOKUP(L7,Sheet4!B:C,2,0),\"Contact acdc for SAP code\")","v":"Contact acdc for SAP code"},"LINELIGHT 180-840 L160 SR","Create code in MyProduct VIVA"]
["ORELLE PRO L03 400-827 AS FG CW 40","LINELIGHT","LINELIGHT Stable white","310mm",400,827,"AS","Diffuse","Cowl",40,"LINELIGHT Stable white310mm827DiffuseCowl","ORELLE PRO L03 400-827 AS FG CW 40",{"$f":"IFERROR(VLOOKUP(L8,Sheet4!B:C,2,0),\"Contact acdc for SAP code\")","v":21005399},"LINELIGHT 400-827 L310 CW SR",21013732]
["ORELLE PRO L03 400-827 AS FG 40","LINELIGHT","LINELIGHT Stable white","310mm",400,827,"AS","Diffuse","No Cowl",40,"LINELIGHT Stable white310mm827DiffuseNo Cowl","ORELLE PRO L03 400-827 AS FG 40",{"$f":"IFERROR(VLOOKUP(L9,Sheet4!B:C,2,0),\"Contact acdc for SAP code\")","v":21005400},"LINELIGHT 400-827 L310 SR",21013733]
["ORELLE PRO L03 400-830 AS FG CW 40","LINELIGHT","LINELIGHT Stable white","310mm",400,830,"AS","Diffuse","Cowl",40,"LINELIGHT Stable white310mm830DiffuseCowl","ORELLE PRO L03 400-830 AS FG CW 40",{"$f":"IFERROR(VLOOKUP(L10,Sheet4!B:C,2,0),\"Contact acdc for SAP code\")","v":21005401},"LINELIGHT 400-830 L310 CW SR",21013702]
["ORELLE PRO L03 400-830 AS FG 40","LINELIGHT","LINELIGHT Stable white","310mm",400,830,"AS","Diffuse","No Cowl",40,"LINELIGHT Stable white310mm830DiffuseNo Cowl","ORELLE PRO L03 400-830 AS FG 40",{"$f":"IFERROR(VLOOKUP(L11,Sheet4!B:C,2,0),\"Contact acdc for SAP code\")","v":21005402},"LINELIGHT 400-830 L310 SR",21013703]
["ORELLE PRO L03 400-842 AS FG CW 40","LINELIGHT","LINELIGHT Stable white","310mm",400,840,"AS","Diffuse","Cowl",40,"LINELIGHT Stable white310mm840DiffuseCowl","ORELLE PRO L03 400-840 AS FG CW 40",{"$f":"IFERROR(VLOOKUP(L12,Sheet4!B:C,2,0),\"Contact acdc for SAP code\")","v":"Contact acdc for SAP code"},"LINELIGHT 400-840 L310 CW SR","Create code in MyProduct VIVA"]
["ORELLE PRO L03 400-842 AS FG 40","LINELIGHT","LINELIGHT Stable white","310mm",400,840,"AS","Diffuse","No Cowl",40,"LINELIGHT Stable white310mm840DiffuseNo Cowl","ORELLE PRO L03 400-840 AS FG 40",{"$f":"IFERROR(VLOOKUP(L13,Sheet4!B:C,2,0),\"Contact acdc for SAP code\")","v":"Contact acdc for SAP code"},"LINELIGHT 400-840 L310 SR","Create code in MyProduct VIVA"]
["ORELLE PRO L06 700-827 AS FG CW 40","LINELIGHT","LINELIGHT Stable white","610mm",700,827,"AS","Diffuse","Cowl",40,"LINELIGHT Stable white610mm827DiffuseCowl","ORELLE PRO L06 700-827 AS FG CW 40",{"$f":"IFERROR(VLOOKUP(L14,Sheet4!B:C,2,0),\"Contact acdc for SAP code\")","v":21005405},"LINELIGHT 700-827 L610 CW SR",21013734]
["ORELLE PRO L06 700-827 AS FG 40","LINELIGHT","LINELIGHT Stable white","610mm",700,827,"AS","Diffuse","No Cowl",40,"LINELIGHT Stable white610mm827DiffuseNo Cowl","ORELLE PRO L06 700-827 AS FG 40",{"$f":"IFERROR(VLOOKUP(L15,Sheet4!B:C,2,0),\"Contact acdc for SAP code\")","v":21005406},"LINELIGHT 700-827 L610 SR",21013735]
{"$rows_left_out":97}
{"sheet":"Sheet4","index":2,"n_rows":110,"n_cols":3,"rows_kept":110,"cut":false,"hidden":true,"merged":[]}
[21005393,"ORELLE PRO L01 180-827 AS FG CW 40",21005393]
[21005394,"ORELLE PRO L01 180-827 AS FG 40",21005394]
[21005395,"ORELLE PRO L01 180-830 AS FG CW 40",21005395]
[21005396,"ORELLE PRO L01 180-830 AS FG 40",21005396]
[21005397,"ORELLE PRO L01 180-842 AS FG CW 40",21005397]
[21005398,"ORELLE PRO L01 180-842 AS FG 40",21005398]
[21005399,"ORELLE PRO L03 400-827 AS FG CW 40",21005399]
[21005400,"ORELLE PRO L03 400-827 AS FG 40",21005400]
[21005401,"ORELLE PRO L03 400-830 AS FG CW 40",21005401]
[21005402,"ORELLE PRO L03 400-830 AS FG 40",21005402]
[21005403,"ORELLE PRO L03 400-842 AS FG CW 40",21005403]
[21005404,"ORELLE PRO L03 400-842 AS FG 40",21005404]
[21005405,"ORELLE PRO L06 700-827 AS FG CW 40",21005405]
[21005406,"ORELLE PRO L06 700-827 AS FG 40",21005406]
[21005407,"ORELLE PRO L06 700-830 AS FG CW 40",21005407]
{"$rows_left_out":96}
{"sheet":"LINELIGHT Spec Builder","index":3,"n_rows":53,"n_cols":36,"rows_kept":53,"cut":false,"hidden":false,"merged":[[49,26,49,28],[50,26,50,28],[51,26,51,28],[52,26,52,28],[3,1,3,34],[6,1,9,1],[15,1,18,1],[24,1,27,1],[33,1,36,1],[44,26,44,28],[45,26,45,28],[46,26,46,28],[47,26,47,28],[48,26,48,28]]}
[]
[]
[]
[null,"Instructions for use: 1. Enter cove length. 2. Choose type of LINELIGHT from drop down list. 3. Choose dimming protocol from drop down list. 4. Choose fitting specific options (CRI/LED colour and whether a cowl is needed) from drop down lists."]
[]
[null,"Cove Length (m)","Cove Length 1 (m)",1.81,"Number of fittings","Length of 1800mm fittings","Remaining m",0.91,"Number of fittings","Length of 900mm fittings","Remaining m",0.61,"Number of fittings","Length of 600mm fittings","Remaining m",0.31,"Number of fittings","Length of 300mm fittings","Remaining m",0.16,"Number of fittings","Length of 150mm fittings","Remaining m",null,"Type of LINELIGHT",null,"Quantity of 1810mm",null,"Quantity of 910mm","Quantity of 610mm",null,"Quantity of 310mm","Quantity of 160mm",null,"Total Length (m)"]
[null,0,{"$f":"B7","v":0},{"$f":"C7/D6","v":0},{"$f":"ROUNDDOWN(D7,0)","v":0},{"$f":"E7*D6","v":0},{"$f":"C7-F7","v":0},{"$f":"G7/H6","v":0},{"$f":"ROUNDDOWN(H7,0)","v":0},{"$f":"I7*H6","v":0},{"$f":"G7-J7","v":0},{"$f":"K7/L6","v":0},{"$f":"ROUNDDOWN(L7,0)","v":0},{"$f":"M7*L6","v":0},{"$f":"K7-N7","v":0},{"$f":"O7/P6","v":0},{"$f":"ROUNDDOWN(P7,0)","v":0},{"$f":"Q7*P6","v":0},{"$f":"O7-R7","v":0},{"$f":"S7/T6","v":0},{"$f":"ROUNDDOWN(T7,0)","v":0},{"$f":"U7*T6","v":0},{"$f":"S7-V7","v":0},null,"Please select from list",{"$f":"VLOOKUP(Y7,Sheet2!D20:E22,2,0)","v":{"$error":"#N/A"}},{"$f":"E7","v":0},null,{"$f":"I7","v":0},{"$f":"M7","v":0},null,{"$f":"Q7","v":0},{"$f":"U7","v":0},null,{"$f":"F7+J7+N7+R7+V7","v":0}]
[null,null,null,18,"Number of drivers 350W","Metre run by 350W","Remaining m",11,"Number of drivers 175W","Metre run by 175W","Remaining m",4,"Number of drivers 70W"]
[null,null,"LINELIGHT Stable white",{"$f":"C7/D8","v":0},{"$f":"ROUND(D9,0)","v":0},{"$f":"E9*D8","v":0},{"$f":"C7-F9","v":0},{"$f":"IF(G9>0,G9/H8,\"0\")","v":"0"},{"$f":"ROUND(H9,0)","v":0},{"$f":"I9*H8","v":0},{"$f":"G9-J9","v":0},{"$f":"IF(K9>0,K9/L8,\"0\")","v":"0"},{"$f":"ROUNDUP(L9,0)","v":0},null,null,null,null,null,null,null,null,null,null,null,"Dimming Protocol",null,"Quantity of 320W drivers",null,"Driver and SAP code","Quantity of 175W drivers",null,"Driver and SAP code","Quantity of 70W drivers",null,"Driver and SAP code"]
[null,null,null,8,"Number of drivers 350W","Metre run by 350W","Remaining m",4,"Number of drivers 175W","Metre run by 175W","Remaining m",1.8,"Number of drivers 70W",null,null,null,null,null,null,null,null,null,null,null,"Choose dimming protocol",{"$f":"VLOOKUP(Y7,Sheet2!D20:F22,3,0)","v":{"$error":"#N/A"}},{"$f":"IF(Y7=C9,E9,IF(Y7=C11,E11,IF(Y7=C13,E13,\"Please check options\")))","v":"Please check options"},{"$f":"CONCATENATE(Y7,\"/\",Y10,\"/\",\"320W\")","v":"Please select from list/Choose dimming protocol/320W"},{"$f":"IFERROR(VLOOKUP(AB10,Sheet2!$H$2:$K$17,4,0),\"Please check options\")","v":"Please check options"},{"$f":"IF(Y7=C9,I9,IF(Y7=C11,I11,IF(Y7=C13,I13,\"Please check options\")))","v":"Please check options"},{"$f":"CONCATENATE(Y7,\"/\",Y10,\"/\",\"175W\")","v":"Please select from list/Choose dimming protocol/175W"},{"$f":"IFERROR(VLOOKUP(AE10,Sheet2!$H$2:$K$17,4,0),\"Please check options\")","v":"Please check options"},{"$f":"IF(Y7=C9,M9,IF(Y7=C11,M11,IF(Y7=C13,M13,\"Please check options\")))","v":"Please check options"},{"$f":"CONCATENATE(Y7,\"/\",Y10,\"/\",\"70W\")","v":"Please select from list/Choose dimming protocol/70W"},{"$f":"IFERROR(VLOOKUP(AH10,Sheet2!$H$2:$K$17,4,0),\"Please check options\")","v":"Please check options"}]
[null,null,"LINELIGHT Balanced white",{"$f":"C7/D10","v":0},{"$f":"ROUND(D11,0)","v":0},{"$f":"E11*D10","v":0},{"$f":"C7-F11","v":0},{"$f":"IF(G11>0,G11/H10,\"0\")","v":"0"},{"$f":"ROUND(H11,0)","v":0},{"$f":"I11*H10","v":0},{"$f":"G11-J11","v":0},{"$f":"IF(K11>0,K11/L10,\"0\")","v":"0"},{"$f":"ROUNDUP(L11,0)","v":0}]
[null,null,null,6,"Number of drivers 350W","Metre run by 350W","Remaining m",4,"Number of drivers 175W","Metre run by 175W","Remaining m",1,"Number of drivers 70W",null,null,null,null,null,null,null,null,null,null,null,"Please select from list"]
[null,null,"LINELIGHT Stable white (EB)",{"$f":"C7/D12","v":0},{"$f":"ROUND(D13,0)","v":0},{"$f":"E13*D12","v":0},{"$f":"C7-F13","v":0},{"$f":"IF(G13>0,G13/H12,\"0\")","v":"0"},{"$f":"ROUND(H13,0)","v":0},{"$f":"I13*H12","v":0},{"$f":"G13-J13","v":0},{"$f":"IF(K13>0,K13/L12,\"0\")","v":"0"},{"$f":"ROUNDUP(L13,0)","v":0}]
[]
[null,"Cove Length 2 (m)","Cove Length 2 (m)",1.81,"Number of fittings","Length of 1800mm fittings","Remaining m",0.91,"Number of fittings","Length of 900mm fittings","Remaining m",0.61,"Number of fittings","Length of 600mm fittings","Remaining m",0.31,"Number of fittings","Length of 300mm fittings","Remaining m",0.16,"Number of fittings","Length of 150mm fittings","Remaining m",null,"Type of Orelle",null,"Quantity of 1800mm",null,"Quantity of 900mm","Quantity of 600mm",null,"Quantity of 300mm","Quantity of 150mm",null,"Total Length (m)"]
{"$rows_left_out":39}
{"sheet":"LINELIGHT Code Finder","index":4,"n_rows":56,"n_cols":36,"rows_kept":56,"cut":false,"hidden":false,"merged":[[9,1,12,1],[18,1,21,1],[27,1,30,1],[36,1,39,1],[47,26,47,28],[54,26,54,28],[55,26,55,28],[1,24,1,34],[48,26,48,28],[49,26,49,28],[50,26,50,28],[51,26,51,28],[52,26,52,28],[53,26,53,28]]}
[]
[null,null,null,null,null,null,null,null,null,null,null,null,null,null,null,null,null,null,null,null,null,null,null,null,"Instructions for use: 1. Choose type of LINELIGHT from drop down list. 2. Enter quantity of each length of fitting required. 3. Choose dimming protocol from drop down list. 4. Choose fitting specific options (CRI/LED colour and whether a cowl is needed) from drop down lists."]
[]
[]
[]
[]
[]
[]
[null,"Cove Length (m)","Cove Length 1 (m)",1.81,"Number of fittings","Length of 1800mm fittings",null,0.91,"Number of fittings","Length of 900mm fittings",null,0.61,"Number of fittings","Length of 600mm fittings",null,0.31,"Number of fittings","Length of 300mm fittings",null,0.16,"Number of fittings","Length of 150mm fittings",null,null,"Type of LINELIGHT",null,"Quantity of 1810mm",null,"Quantity of 910mm","Quantity of 610mm",null,"Quantity of 310mm","Quantity of 160mm",null,"Total Length (m)"]
[null,null,{"$f":"AI10","v":0},{"$f":"C10/D9","v":0},{"$f":"AA10","v":0},{"$f":"E10*D9","v":0},null,null,{"$f":"AC10","v":0},{"$f":"I10*H9","v":0},null,null,{"$f":"AD10","v":0},{"$f":"M10*L9","v":0},null,null,{"$f":"AF10","v":0},{"$f":"Q10*P9","v":0},null,null,{"$f":"AG10","v":0},{"$f":"U10*T9","v":0},null,null,"Please select from list",{"$f":"VLOOKUP(Y10,Sheet2!D20:E22,2,0)","v":{"$error":"#N/A"}},0,null,0,0,null,0,0,null,{"$f":"F10+J10+N10+R10+V10","v":0}]
[null,null,null,18,"Number of drivers 350W","Metre run by 350W","Remaining m",11,"Number of drivers 175W","Metre run by 175W","Remaining m",4,"Number of drivers 70W"]
[null,null,"LINELIGHT Stable white",{"$f":"C10/D11","v":0},{"$f":"ROUND(D12,0)","v":0},{"$f":"E12*D11","v":0},{"$f":"C10-F12","v":0},{"$f":"IF(G12>0,G12/H11,\"0\")","v":"0"},{"$f":"ROUND(H12,0)","v":0},{"$f":"I12*H11","v":0},{"$f":"G12-J12","v":0},{"$f":"IF(K12>0,K12/L11,\"0\")","v":"0"},{"$f":"ROUNDUP(L12,0)","v":0},null,null,null,null,null,null,null,null,null,null,null,"Dimming Protocol",null,"Quantity of 320W drivers",null,"Driver and SAP code","Quantity of 175W drivers",null,"Driver and SAP code","Quantity of 70W drivers",null,"Driver and SAP code"]
[null,null,null,8,"Number of drivers 350W","Metre run by 350W","Remaining m",4,"Number of drivers 175W","Metre run by 175W","Remaining m",1.8,"Number of drivers 70W",null,null,null,null,null,null,null,null,null,null,null,"Choose dimming protocol",{"$f":"VLOOKUP(Y10,Sheet2!D20:F22,3,0)","v":{"$error":"#N/A"}},{"$f":"IF(Y10=C12,E12,IF(Y10=C14,E14,IF(Y10=C16,E16,\"Please check options\")))","v":"Please check options"},{"$f":"CONCATENATE(Y10,\"/\",Y13,\"/\",\"320W\")","v":"Please select from list/Choose dimming protocol/320W"},{"$f":"IFERROR(VLOOKUP(AB13,Sheet2!$H$2:$K$17,4,0),\"Please check options\")","v":"Please check options"},{"$f":"IF(Y10=C12,I12,IF(Y10=C14,I14,IF(Y10=C16,I16,\"Please check options\")))","v":"Please check options"},{"$f":"CONCATENATE(Y10,\"/\",Y13,\"/\",\"175W\")","v":"Please select from list/Choose dimming protocol/175W"},{"$f":"IFERROR(VLOOKUP(AE13,Sheet2!$H$2:$K$17,4,0),\"Please check options\")","v":"Please check options"},{"$f":"IF(Y10=C12,M12,IF(Y10=C14,M14,IF(Y10=C16,M16,\"Please check options\")))","v":"Please check options"},{"$f":"CONCATENATE(Y10,\"/\",Y13,\"/\",\"70W\")","v":"Please select from list/Choose dimming protocol/70W"},{"$f":"IFERROR(VLOOKUP(AH13,Sheet2!$H$2:$K$17,4,0),\"Please check options\")","v":"Please check options"}]
[null,null,"LINELIGHT Balanced white",{"$f":"C10/D13","v":0},{"$f":"ROUND(D14,0)","v":0},{"$f":"E14*D13","v":0},{"$f":"C10-F14","v":0},{"$f":"IF(G14>0,G14/H13,\"0\")","v":"0"},{"$f":"ROUND(H14,0)","v":0},{"$f":"I14*H13","v":0},{"$f":"G14-J14","v":0},{"$f":"IF(K14>0,K14/L13,\"0\")","v":"0"},{"$f":"ROUNDUP(L14,0)","v":0}]
[null,null,null,6,"Number of drivers 350W","Metre run by 350W","Remaining m",4,"Number of drivers 175W","Metre run by 175W","Remaining m",1,"Number of drivers 70W",null,null,null,null,null,null,null,null,null,null,null,"Please select from list"]
{"$rows_left_out":42}
{"sheet":"Orelle Spec Builder (2)","index":5,"n_rows":53,"n_cols":36,"rows_kept":53,"cut":false,"hidden":true,"merged":[[44,26,44,28],[3,1,3,34],[6,1,9,1],[15,1,18,1],[24,1,27,1],[33,1,36,1],[51,26,51,28],[52,26,52,28],[45,26,45,28],[46,26,46,28],[47,26,47,28],[48,26,48,28],[49,26,49,28],[50,26,50,28]]}
[]
[]
[]
[null,"Instructions for use: 1. Enter cove length. 2. Choose type of Orelle from drop down list. 3. Choose dimming protocol from drop down list. 4. Choose fitting specific options (CRI/LED colour, Lens type and whether a cowl is needed) from drop down lists"]
[]
[null,"Cove Length (m)","Cove Length 1 (m)",1.81,"Number of fittings","Length of 1800mm fittings","Remaining m",0.91,"Number of fittings","Length of 900mm fittings","Remaining m",0.61,"Number of fittings","Length of 600mm fittings","Remaining m",0.31,"Number of fittings","Length of 300mm fittings","Remaining m",0.16,"Number of fittings","Length of 150mm fittings","Remaining m",null,"Type of Orelle",null,"Quantity of 1800mm",null,"Quantity of 900mm","Quantity of 600mm",null,"Quantity of 300mm","Quantity of 150mm",null,"Total Length (m)"]
[null,0,{"$f":"B7","v":0},{"$f":"C7/D6","v":0},{"$f":"ROUNDDOWN(D7,0)","v":0},{"$f":"E7*D6","v":0},{"$f":"C7-F7","v":0},{"$f":"G7/H6","v":0},{"$f":"ROUNDDOWN(H7,0)","v":0},{"$f":"I7*H6","v":0},{"$f":"G7-J7","v":0},{"$f":"K7/L6","v":0},{"$f":"ROUNDDOWN(L7,0)","v":0},{"$f":"M7*L6","v":0},{"$f":"K7-N7","v":0},{"$f":"O7/P6","v":0},{"$f":"ROUNDDOWN(P7,0)","v":0},{"$f":"Q7*P6","v":0},{"$f":"O7-R7","v":0},{"$f":"S7/T6","v":0},{"$f":"ROUNDDOWN(T7,0)","v":0},{"$f":"U7*T6","v":0},{"$f":"S7-V7","v":0},null,"Please select from list",{"$f":"VLOOKUP(Y7,Sheet2!D20:E22,2,0)","v":{"$error":"#N/A"}},{"$f":"E7","v":0},null,{"$f":"I7","v":0},{"$f":"M7","v":0},null,{"$f":"Q7","v":0},{"$f":"U7","v":0},null,{"$f":"F7+J7+N7+R7+V7","v":0}]
[null,null,null,18,"Number of drivers 350W","Metre run by 350W","Remaining m",11,"Number of drivers 175W","Metre run by 175W","Remaining m",4,"Number of drivers 70W"]
[null,null,"Orelle Pro Single Colour (SB)",{"$f":"C7/D8","v":0},{"$f":"ROUND(D9,0)","v":0},{"$f":"E9*D8","v":0},{"$f":"C7-F9","v":0},{"$f":"IF(G9>0,G9/H8,\"0\")","v":"0"},{"$f":"ROUND(H9,0)","v":0},{"$f":"I9*H8","v":0},{"$f":"G9-J9","v":0},{"$f":"IF(K9>0,K9/L8,\"0\")","v":"0"},{"$f":"ROUNDUP(L9,0)","v":0},null,null,null,null,null,null,null,null,null,null,null,"Dimming Protocol",null,"Quantity of 320W drivers",null,"Driver and SAP code","Quantity of 175W drivers",null,"Driver and SAP code","Quantity of 70W drivers",null,"Driver and SAP code"]
[null,null,null,8,"Number of drivers 350W","Metre run by 350W","Remaining m",4,"Number of drivers 175W","Metre run by 175W","Remaining m",1.8,"Number of drivers 70W",null,null,null,null,null,null,null,null,null,null,null,"Choose dimming protocol",{"$f":"VLOOKUP(Y7,Sheet2!D20:F22,3,0)","v":{"$error":"#N/A"}},{"$f":"IF(Y7=C9,E9,IF(Y7=C11,E11,IF(Y7=C13,E13,\"Please check options\")))","v":"Please check options"},{"$f":"CONCATENATE(Y7,\"/\",Y10,\"/\",\"320W\")","v":"Please select from list/Choose dimming protocol/320W"},{"$f":"IFERROR(VLOOKUP(AB10,Sheet2!$H$2:$K$17,4,0),\"Please check options\")","v":"Please check options"},{"$f":"IF(Y7=C9,I9,IF(Y7=C11,I11,IF(Y7=C13,I13,\"Please check options\")))","v":"Please check options"},{"$f":"CONCATENATE(Y7,\"/\",Y10,\"/\",\"175W\")","v":"Please select from list/Choose dimming protocol/175W"},{"$f":"IFERROR(VLOOKUP(AE10,Sheet2!$H$2:$K$17,4,0),\"Please check options\")","v":"Please check options"},{"$f":"IF(Y7=C9,M9,IF(Y7=C11,M11,IF(Y7=C13,M13,\"Please check options\")))","v":"Please check options"},{"$f":"CONCATENATE(Y7,\"/\",Y10,\"/\",\"70W\")","v":"Please select from list/Choose dimming protocol/70W"},{"$f":"IFERROR(VLOOKUP(AH10,Sheet2!$H$2:$K$17,4,0),\"Please check options\")","v":"Please check options"}]
[null,null,"Orelle Pro Dynamic White",{"$f":"C7/D10","v":0},{"$f":"ROUND(D11,0)","v":0},{"$f":"E11*D10","v":0},{"$f":"C7-F11","v":0},{"$f":"IF(G11>0,G11/H10,\"0\")","v":"0"},{"$f":"ROUND(H11,0)","v":0},{"$f":"I11*H10","v":0},{"$f":"G11-J11","v":0},{"$f":"IF(K11>0,K11/L10,\"0\")","v":"0"},{"$f":"ROUNDUP(L11,0)","v":0}]
[null,null,null,6,"Number of drivers 350W","Metre run by 350W","Remaining m",4,"Number of drivers 175W","Metre run by 175W","Remaining m",1,"Number of drivers 70W",null,null,null,null,null,null,null,null,null,null,null,"Please select from list"]
[null,null,"Orelle Pro+ Single Colour (EB)",{"$f":"C7/D12","v":0},{"$f":"ROUND(D13,0)","v":0},{"$f":"E13*D12","v":0},{"$f":"C7-F13","v":0},{"$f":"IF(G13>0,G13/H12,\"0\")","v":"0"},{"$f":"ROUND(H13,0)","v":0},{"$f":"I13*H12","v":0},{"$f":"G13-J13","v":0},{"$f":"IF(K13>0,K13/L12,\"0\")","v":"0"},{"$f":"ROUNDUP(L13,0)","v":0}]
[]
[null,"Cove Length 2 (m)","Cove Length 2 (m)",1.81,"Number of fittings","Length of 1800mm fittings","Remaining m",0.91,"Number of fittings","Length of 900mm fittings","Remaining m",0.61,"Number of fittings","Length of 600mm fittings","Remaining m",0.31,"Number of fittings","Length of 300mm fittings","Remaining m",0.16,"Number of fittings","Length of 150mm fittings","Remaining m",null,"Type of Orelle",null,"Quantity of 1800mm",null,"Quantity of 900mm","Quantity of 600mm",null,"Quantity of 300mm","Quantity of 150mm",null,"Total Length (m)"]
{"$rows_left_out":39}
{"sheet":"Driver Starter Lead Info","index":6,"n_rows":18,"n_cols":8,"rows_kept":18,"cut":false,"hidden":true,"merged":[[2,6,2,7],[1,2,1,7]]}
[]
[null,null,"DRIVER AND STARTER LEAD INFORMATION"]
[null,null,"24v Transformer","LINELIGHT Stable white","LINELIGHT Stable white (EB)","LINELIGHT Balanced white","Number of Starter Leads per Driver"]
[null,null,null,"Meterage Capacity (m) ","Meterage Capacity (m) ","Meterage Capacity (m) ","LINELIGHT 1807a/1m","LINELIGHT 1807a/DW/1m"]
[null,null,"EVG"]
[null,null,"LINELIGHT 1992A/70W EVG (21100296)",4,1,null,1]
[null,null,"LINELIGHT 1992A/175W EVG (21100297)",11,4,null,1]
[null,null,"LINELIGHT 1992A/320W EVG (21100298)",18,6,null,2]
[]
[null,null,"LDO"]
[null,null,"LINELIGHT 1992A/70W LDO (21100299)",4,1,null,1]
[null,null,"LINELIGHT 1992A/175W LDO (21100300)",11,4,null,1]
[null,null,"LINELIGHT 1992A/320W LDO (21100301)",18,6,null,2]
[]
[null,null,"DW LDO"]
{"$rows_left_out":3}